姬長信(Redy)

android – 即使使用最新的构建工具,任务’…


我尝试运行我的项目时收到此错误.我已经安装了最新的构建工具-23.0.3但仍然存在错误.我该如何解决?
Executing tasks: [:app:generateDebugSources, :app:generateDebugAndroidTestSources]

Configuration on demand is an incubating feature.
:app:preBuild UP-TO-DATE
:app:preDebugBuild UP-TO-DATE
:app:checkDebugManifest
:app:preReleaseBuild UP-TO-DATE
:app:prepareComAndroidSupportAnimatedVectorDrawable2321Library UP-TO-DATE
:app:prepareComAndroidSupportAppcompatV72321Library UP-TO-DATE
:app:prepareComAndroidSupportDesign2321Library UP-TO-DATE
:app:prepareComAndroidSupportRecyclerviewV72321Library UP-TO-DATE
:app:prepareComAndroidSupportSupportV42321Library UP-TO-DATE
:app:prepareComAndroidSupportSupportVectorDrawable2321Library UP-TO-DATE
:app:prepareComGoogleAndroidGmsPlayServicesAppindexing810Library UP-TO-DATE
:app:prepareComGoogleAndroidGmsPlayServicesBasement810Library UP-TO-DATE
:app:prepareDebugDependencies
:app:compileDebugAidl UP-TO-DATE
:app:compileDebugRenderscript UP-TO-DATE
:app:generateDebugBuildConfig UP-TO-DATE
:app:generateDebugAssets UP-TO-DATE
:app:mergeDebugAssets UP-TO-DATE
:app:generateDebugResValues UP-TO-DATE
:app:generateDebugResources UP-TO-DATE
:app:mergeDebugResources UP-TO-DATE
:app:processDebugManifest
:app:processDebugResources
AGPBI: {"kind":"error","text":"Error retrieving parent for item: No resource found that matches the given name /u0027android:TextAppearance.Material.Widget.Button.Inverse/u0027.","sources":[{"file":"C://Users//Ishmita//Documents//GitHub//FurAlert-Native-Build//app//build//intermediates//res//merged//debug//values-v23//values-v23.xml","position":{"startLine":3}}],"original":"","tool":"AAPT"}

AGPBI: {"kind":"error","text":"Error retrieving parent for item: No resource found that matches the given name /u0027android:Widget.Material.Button.Colored/u0027.","sources":[{"file":"C://Users//Ishmita//Documents//GitHub//FurAlert-Native-Build//app//build//intermediates//res//merged//debug//values-v23//values-v23.xml","position":{"startLine":32}}],"original":"","tool":"AAPT"}


FAILED

FAILURE: Build failed with an exception.

>出了什么问题:
任务’:app:processDebugResources’的执行失败.

com.android.ide.common.process.ProcessException: org.gradle.process.internal.ExecException: Process ‘command ‘C:/Users/Ishmita/AppData/Local/Android/sdk/build-tools/23.0.3/aapt.exe” finished with non-zero exit value 1

>尝试:
使用–stacktrace选项运行以获取堆栈跟踪.使用–info或–debug选项运行以获取更多日志输出.

建筑失败

总时间:5.901秒

SDK manager